4-Hepten-2-ol

Van Den Dool and Kratz RI, non-polar column, custom temperature program

View large format table.

Column type Active phase I Reference Comment
CapillaryDB-5888.Boulanger, Chassagne, et al., 199930. m/0.25 mm/0.25 μm, H2; Program: 40C(5min) => 2C/min => 220C => 5C/min => 250C(15min)

Normal alkane RI, polar column, custom temperature program

View large format table.

Column type Active phase I Reference Comment
CapillaryDB-Wax1302.Miranda, Nogueira, et al., 200130. m/0.25 mm/0.25 μm, He; Program: 25 0C (0.5 min) 50 K/min -> 50 0C 3.5 K/min -> 150 0C 7.5 K/min -> 240 0C

References

Boulanger, Chassagne, et al., 1999
Boulanger, R.; Chassagne, D.; Crouzet, J., Free and bound flavour components of amazonian fruits. 1: Bacuri, Flavour Fragr. J., 1999, 14, 5, 303-311, https://doi.org/10.1002/(SICI)1099-1026(199909/10)14:5<303::AID-FFJ834>3.0.CO;2-C . [all data]

Miranda, Nogueira, et al., 2001
Miranda, E.J.F.; Nogueira, R.I.; Pontes, S.M.; Rezende, C.M., Odour-active compounds of banana passa identified by aroma extract dilution analysis, Flavour Fragr. J., 2001, 16, 4, 281-285, https://doi.org/10.1002/ffj.997 . [all data]