α-Humulene, 1,2-epoxide

Normal alkane RI, non-polar column, temperature ramp

Data compiled by: NIST Mass Spectrometry Data Center, William E. Wallace, director

Column type CapillaryCapillary
Active phase OV-101SE-54
Column length (m) 25.30.
Carrier gas N2Hydrogen
Substrate
Column diameter (mm) 0.250.25
Phase thickness (μm)  0.25
Tstart (C) 50.60.
Tend (C) 200.250.
Heat rate (K/min) 5.2.
Initial hold (min)  5.
Final hold (min)  2.
I 1593.1596.
ReferenceAyedoun, Adéoti, et al., 1999Kollmannsberger, Nitz, et al., 1992
Comment MSDC-RI MSDC-RI

Normal alkane RI, polar column, temperature ramp

Data compiled by: NIST Mass Spectrometry Data Center, William E. Wallace, director

Column type Capillary
Active phase Carbowax 20M
Column length (m) 45.
Carrier gas Hydrogen
Substrate
Column diameter (mm) 0.32
Phase thickness (μm) 1.0
Tstart (C) 60.
Tend (C) 200.
Heat rate (K/min) 2.
Initial hold (min) 5.
Final hold (min)
I 2002.
ReferenceKollmannsberger, Nitz, et al., 1992
Comment MSDC-RI

Normal alkane RI, non-polar column, custom temperature program

Data compiled by: NIST Mass Spectrometry Data Center, William E. Wallace, director

Column type Capillary
Active phase Polydimethyl siloxanes
Column length (m)
Carrier gas
Substrate
Column diameter (mm)
Phase thickness (μm)
Program not specified
I 1596.
ReferenceZenkevich, 1997
Comment MSDC-RI

References

Ayedoun, Adéoti, et al., 1999
Ayedoun, M.A.; Adéoti, B.S.; Setondji, J.; Tchoumbougnang, F.; Kuiaté, J.R.; Zollo, P.H.A.; Menut, C.; Lamaty, G.; Bessière, J.M., Aromatic plants of tropical West Africa. XII. Essential oil of Hoslundia opposita Vahl. growing in Benin and Cameroon, Flavour Fragr. J., 1999, 14, 5, 319-321, https://doi.org/10.1002/(SICI)1099-1026(199909/10)14:5<319::AID-FFJ836>3.0.CO;2-O . [all data]

Kollmannsberger, Nitz, et al., 1992
Kollmannsberger, H.; Nitz, S.; Drawert, F., UBer die Aromastoffzusammensetzung von Hochdruckextrakten. I. Pfeffer (Piper nigrum, Var. muntok), Z. Lebensm. Unters Forsch., 1992, 194, 6, 545-551, https://doi.org/10.1007/BF01185481 . [all data]