10-epi-Junenol
- Formula: C15H26O
- Molecular weight: 222.3663
- IUPAC Standard InChIKey: WVGOZCUPNULHAM-KBUPBQIOSA-N
- Chemical structure:

Normal alkane RI, non-polar column, temperature ramp

Column type | Active phase | I | Reference | Comment |
---|---|---|---|---|
Capillary | CP Sil 5 CB | 1579. | Tesso, Kubeczka, et al., 2006 | 3. K/min; Column length: 25. m; Column diameter: 0.25 mm; Tstart: 50. C; Tend: 230. C |

Normal alkane RI, non-polar column, custom temperature program

Column type | Active phase | I | Reference | Comment |
---|---|---|---|---|
Capillary | CP Sil 5 CB | 1578. | Weyerstahl, Marschall, et al., 1998 | N2; Column length: 25. m; Program: not specified |

References

Tesso, Kubeczka, et al., 2006
Tesso, H.; Kubeczka, K.-H.; König, W.A.,
A new phthalide from the essential oil of Meum athamanticum,
Flavour Fragr. J., 2006, 21, 4, 622-625, https://doi.org/10.1002/ffj.1629
. [all data]
Weyerstahl, Marschall, et al., 1998
Weyerstahl, P.; Marschall, H.; Wolf, D.,
Constituents of commercial Brazilian cabore oil,
Flavour Fragr. J., 1998, 13, 2, 85-86, https://doi.org/10.1002/(SICI)1099-1026(199803/04)13:2<85::AID-FFJ697>3.0.CO;2-9
. [all data]