Viridiflorine

Kovats' RI, non-polar column, temperature ramp

View large format table.

Column type Active phase I Reference Comment
CapillaryOV-11982.El-Shazly, El-Domiaty, et al., 1998He, 6. K/min; Column length: 30. m; Tstart: 150. C; Tend: 300. C
CapillaryDB-11983.El-Shazly, Sarg, et al., 1996He, 170. C @ 5. min, 10. K/min, 300. C @ 15. min; Column length: 30. m

References

El-Shazly, El-Domiaty, et al., 1998
El-Shazly, A.; El-Domiaty, M.; Witte, L.; Wink, M., Pyrrolizidine alkaloids in members of the boraginaceae from Sinai (Egypt), Biochem. Syst. Ecol., 1998, 26, 6, 619-636, https://doi.org/10.1016/S0305-1978(98)00028-3 . [all data]

El-Shazly, Sarg, et al., 1996
El-Shazly, A.; Sarg, T.; Ateya, A.; Abdel Aziz, E.; Witte, L.; Wink, M., Pyrrolizidine alkaloids of cynoglossum officinale and Cynoglossum amabile (family boraginaceae), Biochem. Syst. Ecol., 1996, 24, 5, 415-421, https://doi.org/10.1016/0305-1978(96)00035-X . [all data]