7-acetylintermedine

Kovats' RI, non-polar column, temperature ramp

View large format table.

Column type Active phase I Reference Comment
CapillaryOV-12220.El-Shazly, El-Domiaty, et al., 1998He, 6. K/min; Column length: 30. m; Tstart: 150. C; Tend: 300. C

Van Den Dool and Kratz RI, non-polar column, temperature ramp

View large format table.

Column type Active phase I Reference Comment
CapillaryDB-12220.Weber, Eisenreich, et al., 1999He, 6. K/min; Column length: 30. m; Column diameter: 0.32 mm; Tstart: 150. C; Tend: 300. C

Normal alkane RI, non-polar column, custom temperature program

View large format table.

Column type Active phase I Reference Comment
CapillaryDB-12216.Frolich, Ober, et al., 2007Column length: 30. m; Column diameter: 0.32 mm; Program: not specified

References

El-Shazly, El-Domiaty, et al., 1998
El-Shazly, A.; El-Domiaty, M.; Witte, L.; Wink, M., Pyrrolizidine alkaloids in members of the boraginaceae from Sinai (Egypt), Biochem. Syst. Ecol., 1998, 26, 6, 619-636, https://doi.org/10.1016/S0305-1978(98)00028-3 . [all data]

Weber, Eisenreich, et al., 1999
Weber, S.; Eisenreich, W.; Bacher, A.; Hartmann, T., Pyrrolizidine alkaloids of the lycopsamine type: biosynthesis of thracelanthic acid, Phytochemistry, 1999, 50, 6, 1005-1014, https://doi.org/10.1016/S0031-9422(98)00203-9 . [all data]

Frolich, Ober, et al., 2007
Frolich, C.; Ober, D.; Hartmann, T., Tissue distribution, core biosynthesis and diversification of pyrrolizidine alkaloids of the lycopsamine type in three Boraginaceae species, Phytochemistry, 2007, 68, 7, 1026-1037, https://doi.org/10.1016/j.phytochem.2007.01.002 . [all data]