(1-propenyl)pyrazine (Z)

Van Den Dool and Kratz RI, non-polar column, custom temperature program

Data compiled by: NIST Mass Spectrometry Data Center, William E. Wallace, director

Column type Capillary
Active phase BPX-5
Column length (m) 50.
Carrier gas He
Substrate
Column diameter (mm) 0.32
Phase thickness (μm) 0.5
Program OC (5min) => 60C/min => 60C(5min) => 4C/min => 250C
I 1073.
ReferenceBredie, Mottram, et al., 1998
Comment MSDC-RI

References

Bredie, Mottram, et al., 1998
Bredie, W.L.P.; Mottram, D.S.; Guy, R.C.E., Aroma volatiles generated during extrusion cooking of maize flour, J. Agric. Food Chem., 1998, 46, 4, 1479-1487, https://doi.org/10.1021/jf9708857 . [all data]