7-epi-α-Bisabolol

Normal alkane RI, non-polar column, temperature ramp

Data compiled by: NIST Mass Spectrometry Data Center, William E. Wallace, director

Column type Capillary
Active phase DB-5
Column length (m) 30.
Carrier gas He
Substrate
Column diameter (mm) 0.25
Phase thickness (μm) 0.25
Tstart (C) 60.
Tend (C) 300.
Heat rate (K/min) 3.
Initial hold (min)
Final hold (min)
I 1679.
ReferenceLimberger, Sobral, et al., 2004
Comment MSDC-RI

References

Limberger, Sobral, et al., 2004
Limberger, R.P.; Sobral, M.; Henriques, A.T.; Menut, C.; Bessière, J.-M., Óleos voláteis de espécies de Myrcia nativas do rio grande do sul, Quim. Nova, 2004, 27, 6, 916-919, https://doi.org/10.1590/S0100-40422004000600015 . [all data]