Davanone C

Normal alkane RI, non-polar column, custom temperature program

View large format table.

Column type Active phase I Reference Comment
CapillaryCP Sil 5 CB1526.Weyerstahl, Marschall, et al., 1997He; Column length: 25. m; Program: not specified

References

Weyerstahl, Marschall, et al., 1997
Weyerstahl, P.; Marschall, H.; Schröder, M.; Wahlburg, H.-C.; Kaul, V.K., The sesquiterpene fraction of the essential oil of Artemisia laciniata Willd., Flavour Fragr. J., 1997, 12, 5, 315-325, https://doi.org/10.1002/(SICI)1099-1026(199709/10)12:5<315::AID-FFJ662>3.0.CO;2-Q . [all data]