2,3,4,6,8-pentathianonane

Normal alkane RI, non-polar column, temperature ramp

View large format table.

Column type Active phase I Reference Comment
CapillaryDB-11673.Rapior, Breheret, et al., 199730. m/0.2 mm/0.25 μm, He, 50. C @ 2. min, 4. K/min; Tend: 200. C

References

Rapior, Breheret, et al., 1997
Rapior, S.; Breheret, S.; Talou, T.; Bessiére, J.-M., Volatile flavor constituents of fresh Marasmius alliaceus (garlic Marasmius), J. Agric. Food Chem., 1997, 45, 3, 820-825, https://doi.org/10.1021/jf960511y . [all data]