Silphiperfolan-6-ol I

Normal alkane RI, polar column, temperature ramp

Data compiled by: NIST Mass Spectrometry Data Center, William E. Wallace, director

Column type Capillary
Active phase DB-Wax
Column length (m) 30.
Carrier gas N2
Substrate
Column diameter (mm) 0.25
Phase thickness (μm)
Tstart (C) 100.
Tend (C) 220.
Heat rate (K/min) 5.
Initial hold (min)
Final hold (min)
I 1930.
ReferenceMenut, Lamaty, et al., 1997
Comment MSDC-RI

References

Menut, Lamaty, et al., 1997
Menut, C.; Lamaty, G.; Weyerstahl, P.; Marschall, H.; Seelmann, I.; Amvam Zollo, P.H., Aromatic plants of tropical central Africa. Part XXXI. Tricyclic sesquiterpenes from the root essential oil of Echinops giganteus var. lelyi C. D. Adams, Flavour Fragr. J., 1997, 12, 6, 415-421, https://doi.org/10.1002/(SICI)1099-1026(199711/12)12:6<415::AID-FFJ666>3.0.CO;2-T . [all data]