Presilphiperfolan-8-ol

Normal alkane RI, non-polar column, temperature ramp

View large format table.

Column type Active phase I Reference Comment
CapillaryVF-5MS1597.Kowalski, 200830. m/0.25 mm/0.25 μm, Helium, 240. C @ 1. min, 20. K/min; Tend: 320. C
CapillaryDB-51586.Morteza-Semnani, Akbarzadeh, et al., 200530. m/0.25 mm/0.25 μm, He, 60. C @ 5. min, 4. K/min; Tend: 220. C
CapillaryOV-1011600.Menut, Lamaty, et al., 1997N2, 5. K/min; Column length: 30. m; Column diameter: 0.25 mm; Tstart: 100. C; Tend: 220. C

Normal alkane RI, non-polar column, custom temperature program

View large format table.

Column type Active phase I Reference Comment
CapillaryCP Sil 5 CB1580.Weyerstahl, Marschall, et al., 1998N2; Column length: 25. m; Phase thickness: 0.39 μm; Program: not specified

Normal alkane RI, polar column, temperature ramp

View large format table.

Column type Active phase I Reference Comment
CapillaryDB-Wax2018.Menut, Lamaty, et al., 1997N2, 5. K/min; Column length: 30. m; Column diameter: 0.25 mm; Tstart: 100. C; Tend: 220. C

Normal alkane RI, polar column, custom temperature program

View large format table.

Column type Active phase I Reference Comment
CapillaryDB-Wax2076.Weyerstahl, Marschall, et al., 1998N2; Column length: 60. m; Phase thickness: 0.25 μm; Program: not specified

References

Kowalski, 2008
Kowalski, R., Antimicrobial activity of essential oils and extracts of rosinweed (Silphoum trifoliatum and Silphium integrifolium) plants used by the American Indians, Flav. Fragr. J., 2008, 23, 6, 426-433, https://doi.org/10.1002/ffj.1901 . [all data]

Morteza-Semnani, Akbarzadeh, et al., 2005
Morteza-Semnani, K.; Akbarzadeh, M.; Rostami, B., The essential oil composition of Teucrium chamaedrys L. from Iran, Flavour Fragr. J., 2005, 20, 5, 544-546, https://doi.org/10.1002/ffj.1479 . [all data]

Menut, Lamaty, et al., 1997
Menut, C.; Lamaty, G.; Weyerstahl, P.; Marschall, H.; Seelmann, I.; Amvam Zollo, P.H., Aromatic plants of tropical central Africa. Part XXXI. Tricyclic sesquiterpenes from the root essential oil of Echinops giganteus var. lelyi C. D. Adams, Flavour Fragr. J., 1997, 12, 6, 415-421, https://doi.org/10.1002/(SICI)1099-1026(199711/12)12:6<415::AID-FFJ666>3.0.CO;2-T . [all data]

Weyerstahl, Marschall, et al., 1998
Weyerstahl, P.; Marschall, H.; Seelmann, I.; Jakupovic, J., Cameroonane, Prenopsane and Nopsane, Three New Tricyclic Sesquiterpene Skeletons, Eur.J.Org.Chem., 1998, 1998, 6, 1205-1212, https://doi.org/10.1002/(SICI)1099-0690(199806)1998:6<1205::AID-EJOC1205>3.0.CO;2-K . [all data]