7-epi-Silphiperfol-5-ene

Van Den Dool and Kratz RI, non-polar column, temperature ramp

Data compiled by: NIST Mass Spectrometry Data Center, William E. Wallace, director

Column type CapillaryCapillaryCapillaryCapillary
Active phase RTX-1RTX-1HP-5MSRTX-1
Column length (m) 60.60.30.60.
Carrier gas HeHeHeHe
Substrate
Column diameter (mm) 0.220.220.250.22
Phase thickness (μm) 0.250.250.250.25
Tstart (C) 60.60.60.60.
Tend (C) 230.230.280.230.
Heat rate (K/min) 2.2.3.2.
Initial hold (min)
Final hold (min) 35.35. 35.
I 1348.1348.1314.1348.
ReferencePaolini J., Costa J., et al., 2007Paolini, Muselli, et al., 2007Pavlovic, Kovacevic, et al., 2006Paolini, Costa, et al., 2005
Comment MSDC-RI MSDC-RI MSDC-RI MSDC-RI

Normal alkane RI, polar column, custom temperature program

Data compiled by: NIST Mass Spectrometry Data Center, William E. Wallace, director

Column type CapillaryCapillary
Active phase HP-Innowax FSCDB-Wax
Column length (m) 60.60.
Carrier gas N2N2
Substrate
Column diameter (mm) 0.25
Phase thickness (μm) 0.250.25
Program 60C(10min) => 4C/min => 220C(10min) => 1C/min => 240Cnot specified
I 1454.1468.
ReferenceDemirci B., Baser K.H.C., et al., 2006Weyerstahl, Marschall, et al., 1998
Comment MSDC-RI MSDC-RI

References

Paolini J., Costa J., et al., 2007
Paolini J.; Costa J.; Bernardini A.F., Analysis of the essential oil from the roots of Eupatorium cannabinum subsp corsicum (L.) by GC, GC-MS and C-13-NMR, Phytochem. Anal., 2007, 18, 3, 235-244, https://doi.org/10.1002/pca.977 . [all data]

Paolini, Muselli, et al., 2007
Paolini, J.; Muselli, A.; Bernardini, A.-F.; Bighelli, A.; Casanova, J.; Costa, J., Thymol derivatives from essential oil of Doronicum corsicum L., Flavour Fragr. J., 2007, 22, 6, 479-487, https://doi.org/10.1002/ffj.1824 . [all data]

Pavlovic, Kovacevic, et al., 2006
Pavlovic, M.; Kovacevic, N.; Tzakou, O.; Couladis, M., Essential oil composition of Anthemis triumfetti (L.) DC., Flavour Fragr. J., 2006, 21, 2, 297-299, https://doi.org/10.1002/ffj.1592 . [all data]

Paolini, Costa, et al., 2005
Paolini, J.; Costa, J.; Bernardini, A., Analysis of the essential oil from aerial parts of Eupatorium cannabinum subsp. corsicum (L.) by gas chromatography with electron impact and chemical ionization mass spectrometry, J. Chromatogr. A, 2005, 1076, 1-2, 170-178, https://doi.org/10.1016/j.chroma.2005.03.131 . [all data]