β-cyclogeraniumacid methyl ester

Normal alkane RI, non-polar column, temperature ramp

Data compiled by: NIST Mass Spectrometry Data Center, William E. Wallace, director

Column type Capillary
Active phase SPB-Sulfur
Column length (m) 30.
Carrier gas He
Substrate
Column diameter (mm) 0.32
Phase thickness (μm) 4.
Tstart (C) 45.
Tend (C) 240.
Heat rate (K/min) 5.
Initial hold (min) 13.
Final hold (min) 5.
I 1235.
ReferenceMariaca, Berger, et al., 1997
Comment MSDC-RI

References

Mariaca, Berger, et al., 1997
Mariaca, R.G.; Berger, T.F.H.; Gauch, R.; Imhof, M.I.; Jeangros, B.; Bosset, J.O., Occurrence of volatile mono- and sesquiterpenoids in highland and lowland plant species as possible precursors for flavor compounds in milk and dairy products, J. Agric. Food Chem., 1997, 45, 11, 4423-4434, https://doi.org/10.1021/jf970216t . [all data]