bis(1-(2'-furyl)-1-ethyl) disulfide

Van Den Dool and Kratz RI, non-polar column, custom temperature program

View large format table.

Column type Active phase I Reference Comment
CapillarySE-541732.Hofmann and Schieberle, 199730. m/0.32 mm/0.25 μm, He; Program: 40C (2min) => 40C/min => 50C (5min) => 6C/min => 230C (15min)

Van Den Dool and Kratz RI, polar column, custom temperature program

View large format table.

Column type Active phase I Reference Comment
CapillaryFFAP2422.Hofmann and Schieberle, 199730. m/0.32 mm/0.25 μm, He; Program: 40C (2min) => 40C/min => 60C (5min) => 6C/min => 230C (15min)

References

Hofmann and Schieberle, 1997
Hofmann, T.; Schieberle, P., Identification of potent aroma compounds in thermally treated mixtures of glucose/cysteine and rhamnose/cysteine using aroma extract dilution techniques, J. Agric. Food Chem., 1997, 45, 3, 898-906, https://doi.org/10.1021/jf960456t . [all data]