2-propionyl-2-thiazoline

Van Den Dool and Kratz RI, non-polar column, custom temperature program

Data compiled by: NIST Mass Spectrometry Data Center, William E. Wallace, director

Column type CapillaryCapillaryCapillary
Active phase DB-5SE-54SE-54
Column length (m) 30.30.30.
Carrier gas He He
Substrate
Column diameter (mm) 0.320.320.32
Phase thickness (μm) 0.250.250.25
Program 40C (2min) => 40C/min => 60C (1min) => 6C/min => 230C (15min)35C(2min) => 40C/min => 50C(5min) => 6C/min => 230C(15min)40C (2min) => 40C/min => 50C (5min) => 6C/min => 230C (15min)
I 1205.1196.1196.
ReferenceEngel and Schieberle, 2002Hofmann and Schieberle, 1998Hofmann and Schieberle, 1997
Comment MSDC-RI MSDC-RI MSDC-RI

Van Den Dool and Kratz RI, polar column, custom temperature program

Data compiled by: NIST Mass Spectrometry Data Center, William E. Wallace, director

Column type CapillaryCapillaryCapillary
Active phase FFAPFFAPFFAP
Column length (m) 30.30.30.
Carrier gas He He
Substrate
Column diameter (mm) 0.320.320.32
Phase thickness (μm) 0.250.250.25
Program 40C (2min) => 40C/min => 60C (1min) => 6C/min => 230C (15min)35C(2min) => 40C/min => 60C(5min) => 6C/min => 230C(15min)40C (2min) => 40C/min => 60C (5min) => 6C/min => 230C (15min)
I 1850.1840.1803.
ReferenceEngel and Schieberle, 2002Hofmann and Schieberle, 1998Hofmann and Schieberle, 1997
Comment MSDC-RI MSDC-RI MSDC-RI

References

Engel and Schieberle, 2002
Engel, W.; Schieberle, P., Identification and quantitation of key aroma compounds formed in Maillard-type reactions of fructose with cysteamine or isothiaproline (1,3-thiazolidine-2-carboxylic acid), J. Agric. Food Chem., 2002, 50, 19, 5394-5399, https://doi.org/10.1021/jf0203186 . [all data]

Hofmann and Schieberle, 1998
Hofmann, T.; Schieberle, P., Identification of key aroma compounds generated from cysteine and carbohydrates under roasting conditions, Z. Lebensm. Unters. Forsch. A, 1998, 207, 3, 229-236, https://doi.org/10.1007/s002170050324 . [all data]

Hofmann and Schieberle, 1997
Hofmann, T.; Schieberle, P., Identification of potent aroma compounds in thermally treated mixtures of glucose/cysteine and rhamnose/cysteine using aroma extract dilution techniques, J. Agric. Food Chem., 1997, 45, 3, 898-906, https://doi.org/10.1021/jf960456t . [all data]