3-oxo-retro-α-ionol

Van Den Dool and Kratz RI, non-polar column, custom temperature program

View large format table.

Column type Active phase I Reference Comment
CapillaryDB-5MS1698.Boulanger and Crouzet, 200130. m/0.25 mm/0.25 μm, H2; Program: 40C (5min) => 2C/min => 200C => 5C/min => 250C (15min)

Van Den Dool and Kratz RI, polar column, temperature ramp

View large format table.

Column type Active phase I Reference Comment
CapillaryDB-Wax2829.Ollé, Baumes, et al., 199830. m/0.32 mm/0.5 μm, 40. C @ 3. min, 3. K/min, 245. C @ 20. min
CapillaryDB-Wax2846.Suárez, Duque, et al., 199130. m/0.259 mm/0.25 μm, He, 50. C @ 3. min, 4. K/min; Tend: 240. C
CapillaryDB-Wax2850.Suárez, Duque, et al., 199130. m/0.259 mm/0.25 μm, He, 50. C @ 3. min, 4. K/min; Tend: 240. C

Van Den Dool and Kratz RI, polar column, custom temperature program

View large format table.

Column type Active phase I Reference Comment
CapillaryStabilwax2797.Natali N., Chinnici F., et al., 200630. m/0.25 mm/0.25 μm, He; Program: 40C => 3C/min => 100C => 5C/min => 240C(10min)

Normal alkane RI, non-polar column, temperature ramp

View large format table.

Column type Active phase I Reference Comment
CapillaryBPX-51738.D'Arcy, Rintoul, et al., 199750. m/0.22 mm/0.25 μm, He, 50. C @ 1. min, 3. K/min, 250. C @ 10. min

References

Boulanger and Crouzet, 2001
Boulanger, R.; Crouzet, J., Identification of the aroma components of acerola (Malphigia glabra L.): free and bound flavor compounds, Food Chem., 2001, 74, 2, 209-216, https://doi.org/10.1016/S0308-8146(01)00128-5 . [all data]

Ollé, Baumes, et al., 1998
Ollé, D.; Baumes, R.L.; Bayonove, C.L.; Lozano, Y.F.; Sznaper, C.; Brillouet, J.-M., Comparison of free and glycosidically linked volatile components from polyembryonic and monoembryonic mango (Mangifera indica L.) cultivars, J. Agric. Food Chem., 1998, 46, 3, 1094-1100, https://doi.org/10.1021/jf9705781 . [all data]

Suárez, Duque, et al., 1991
Suárez, M.; Duque, C.; Wintoch, H.; Schreier, P., Glycosidically bound aroma compounds from the pulp and the peelings of lulo fruit (Solanum vestissimum D.), J. Agric. Food Chem., 1991, 39, 9, 1643-1645, https://doi.org/10.1021/jf00009a022 . [all data]

Natali N., Chinnici F., et al., 2006
Natali N.; Chinnici F.; Riponi C., Characterization of volatiles in extracts from oak chips obtained by accelerated solvent extraction (ASE), J. Agric. Food Chem., 2006, 54, 21, 8190-8198, https://doi.org/10.1021/jf0614387 . [all data]

D'Arcy, Rintoul, et al., 1997
D'Arcy, B.R.; Rintoul, G.B.; Rowland, C.Y.; Blackman, A.J., Composition of Australian honey extractives. 1. Norisoprenoids, monoterpenes, and other natural volatiles from blue gum (Eucalyptus leucoxylon) and yellow box (Eucalyptus melliodora) honeys, J. Agric. Food Chem., 1997, 45, 5, 1834-1843, https://doi.org/10.1021/jf960625+ . [all data]