Isoeugenyl isovalerate

Normal alkane RI, non-polar column, temperature ramp

View large format table.

Column type Active phase I Reference Comment
CapillaryCP Sil 5 CB1814.Bos, Woerdenbag, et al., 199725. m/0.25 mm/0.25 μm, He, 6. K/min; Tstart: 60. C; Tend: 300. C

References

Bos, Woerdenbag, et al., 1997
Bos, R.; Woerdenbag, H.J.; Hendriks, H.; Scheffer, J.J.C., Composition of the essential oils from underground parts of Valeriana officinalis L. s.l. and several closely related taxa, Flavour Fragr. J., 1997, 12, 5, 359-370, https://doi.org/10.1002/(SICI)1099-1026(199709/10)12:5<359::AID-FFJ660>3.0.CO;2-G . [all data]