Patchoulyl acetate

Normal alkane RI, non-polar column, temperature ramp

View large format table.

Column type Active phase I Reference Comment
CapillaryCP Sil 5 CB2001.Bos, Woerdenbag, et al., 199725. m/0.32 mm/0.25 μm, N2, 4. K/min; Tstart: 50. C; Tend: 290. C
CapillaryCP Sil 5 CB2001.Bos, Woerdenbag, et al., 199725. m/0.32 mm/0.25 μm, N2, 4. K/min; Tstart: 50. C; Tend: 290. C
CapillaryCP Sil 5 CB2001.Bos, Woerdenbag, et al., 1997, 225. m/0.25 mm/0.25 μm, He, 6. K/min; Tstart: 60. C; Tend: 300. C

References

Bos, Woerdenbag, et al., 1997
Bos, R.; Woerdenbag, H.J.; Hendriks, H.; Smit, H.F.; Wikström, H.V.; Scheffer, J.J.C., Composition of the essential oil from roots and rhizomes of Valeriana wallichii DC, Flavour Fragr. J., 1997, 12, 2, 123-131, https://doi.org/10.1002/(SICI)1099-1026(199703)12:2<123::AID-FFJ613>3.0.CO;2-4 . [all data]

Bos, Woerdenbag, et al., 1997, 2
Bos, R.; Woerdenbag, H.J.; Hendriks, H.; Scheffer, J.J.C., Composition of the essential oils from underground parts of Valeriana officinalis L. s.l. and several closely related taxa, Flavour Fragr. J., 1997, 12, 5, 359-370, https://doi.org/10.1002/(SICI)1099-1026(199709/10)12:5<359::AID-FFJ660>3.0.CO;2-G . [all data]