δ-Terpinene

Normal alkane RI, non-polar column, temperature ramp

View large format table.

Column type Active phase I Reference Comment
CapillaryHP-5 MS1020.Ogunwande, Flamini, et al., 201030. m/0.25 mm/0.25 μm, Helium, 60. C @ 10. min, 5. K/min; Tend: 220. C
CapillaryDB-51051.Rahimi-Nasrabadi, Gholivand, et al., 200930. m/0.25 mm/0.25 μm, Nitrogen, 40. C @ 1. min, 3. K/min, 250. C @ 10. min
CapillaryCP Sil 5 CB1050.Asekun and Ekundayo, 200025. m/0.25 mm/0.15 μm, 3. K/min; Tstart: 50. C; Tend: 230. C

Normal alkane RI, non-polar column, custom temperature program

View large format table.

Column type Active phase I Reference Comment
CapillaryDB-51059.Anitescu, Doneanu, et al., 199715. m/0.25 mm/0.25 μm, He; Program: 40C(5min) => 5C/min => 120C(10min) => 4C/min => 250C(4min) => 5C/min => 280C

Normal alkane RI, polar column, custom temperature program

View large format table.

Column type Active phase I Reference Comment
CapillaryCarbowax 20M1284.Acree and Arn, 2004Program: not specified

References

Ogunwande, Flamini, et al., 2010
Ogunwande, I.A.; Flamini, G.; Cioni, P.L.; Omikorede, O.; Azeez, R.A.; Ayodele, A.A.; Kamil, Y.O., Aromatic plants growing in Nigeria: essential oil constituents of Cassia alata (Linn.) Roxb. and Helianthus annuus L., Rec. Nat. Prod., 2010, 4, 4, 211-217. [all data]

Rahimi-Nasrabadi, Gholivand, et al., 2009
Rahimi-Nasrabadi, M.; Gholivand, M.B.; Batooli, H.; Vatanara, A., Chemical composition of the essential oil from leaves and flowering aerial parts of Psammogeton canscens (DC). Vake from Iran, J. Medicinal Plants, 2009, 8, 31, 82-86. [all data]

Asekun and Ekundayo, 2000
Asekun, O.T.; Ekundayo, O., Essential oil constituents of Hyptis suaveolens (L.) Poit. (Bush tea) leaves from Nigeria, J. Essent. Oil Res., 2000, 12, 227-230. [all data]

Anitescu, Doneanu, et al., 1997
Anitescu, G.; Doneanu, C.; Radulescu, V., Isolation of Coriander oil: comparison between steam distillation and supercritical CO2 extraction, Flavour Fragr. J., 1997, 12, 3, 173-176, https://doi.org/10.1002/(SICI)1099-1026(199705)12:3<173::AID-FFJ630>3.0.CO;2-1 . [all data]

Acree and Arn, 2004
Acree, T.; Arn, H., Flavornet, 2004, retrieved from http://www.flavornet.org/. [all data]