Thujopsadiene

Normal alkane RI, non-polar column, temperature ramp

View large format table.

Column type Active phase I Reference Comment
CapillaryCP-Sil 5 CB1486.Hnawia, Menut, et al., 200930. m/0.25 mm/0.25 μm, Nitrogen, 5. K/min; Tstart: 50. C; Tend: 200. C
CapillaryDB-51464.El-Ghorab A., El-Massry K.F., et al., 200730. m/0.25 mm/0.25 μm, He, 3. K/min, 220. C @ 40. min; Tstart: 35. C
CapillaryDB-51472.Krauze-Baranowska, Mardarowicz, et al., 200230. m/0.25 mm/0.25 μm, He, 35. C @ 2. min, 4. K/min, 280. C @ 15. min
CapillaryDB-51458.Abreu and Noronha, 1997He, 3. K/min; Column length: 30. m; Column diameter: 0.32 mm; Tstart: 60. C; Tend: 250. C

Normal alkane RI, non-polar column, custom temperature program

View large format table.

Column type Active phase I Reference Comment
CapillaryHP-51460.Duschatzky, Almeida, et al., 200730. m/0.25 mm/0.25 μm; Program: 75C(4min) => 5C/min => 135C => 1C/min => 220C => 10C/min => 280C
CapillaryOV-11445.Hafez and Abdel-Salam, 200430. m/0.25 mm/0.25 μm, He; Program: 45 0C (4 min) 3 0C/min -> 75 0C 4 0C/min -> 115 0C 6 0C/min -> 312 0C

Normal alkane RI, polar column, temperature ramp

View large format table.

Column type Active phase I Reference Comment
CapillaryDB-Wax1650.Abreu and Noronha, 1997He, 3. K/min; Column length: 30. m; Column diameter: 0.32 mm; Tstart: 60. C; Tend: 250. C

References

Hnawia, Menut, et al., 2009
Hnawia, E.; Menut, C.; Agrebi, A.; Cabalion, P., Wood essential oil of two endemic trees from New Caledonia: Callitris sulcata (Parl.) Schltr. and Callitris neocaledonica Dummer, Biochem. Systematics Ecol., 2009, 36, 11, 859-866, https://doi.org/10.1016/j.bse.2008.08.007 . [all data]

El-Ghorab A., El-Massry K.F., et al., 2007
El-Ghorab A.; El-Massry K.F.; Shibamoto T., Chemical composition of the volatile extract and antioxidant activities of the volatile and nonvolatile extracts of Egyptian corn silk (Zea mays L.), J. Agric. Food Chem., 2007, 55, 22, 9124-9127, https://doi.org/10.1021/jf071646e . [all data]

Krauze-Baranowska, Mardarowicz, et al., 2002
Krauze-Baranowska, M.; Mardarowicz, M.; Wiwart, M., The chemical composition of Microbiota decussata, Z. Naturforsch. C:, 2002, 57c, 998-1003. [all data]

Abreu and Noronha, 1997
Abreu, P.M.; Noronha, R.G., Volatile constituents of the rhizomes of Aframomum alboviolaceum (Ridley) K. Schum. from Guinea-Bissau, Flavour Fragr. J., 1997, 12, 2, 79-83, https://doi.org/10.1002/(SICI)1099-1026(199703)12:2<79::AID-FFJ617>3.0.CO;2-7 . [all data]

Duschatzky, Almeida, et al., 2007
Duschatzky, C.B.; Almeida, N.V.; Possetto, M.; Michis, F.; Scappini, E.; Lampasona, M.P.; Shuff, C., Essential oil composition of Heterothalamus alienus (Spreng.) Kuntze (Romerillo) from Argentina. Effect of harvesting period on the essential oil composition, Flavour Fragr. J., 2007, 22, 1, 39-41, https://doi.org/10.1002/ffj.1747 . [all data]

Hafez and Abdel-Salam, 2004
Hafez, S.S.; Abdel-Salam, H.A., chemical composition and antimicrobial activity of the volatile constituents of thuja occidentalis L. growing in Egipt, Alexandria J. Pharm. Sci., 2004, 18, 1, 41-47. [all data]