3-Hexenyl acetate

Normal alkane RI, non-polar column, temperature ramp

Data compiled by: NIST Mass Spectrometry Data Center, William E. Wallace, director

Column type CapillaryCapillary
Active phase HP-1RSL-200
Column length (m) 30.30.
Carrier gas HeH2
Substrate
Column diameter (mm) 0.250.32
Phase thickness (μm) 0.330.25
Tstart (C) 40.40.
Tend (C) 260.280.
Heat rate (K/min) 2.6.
Initial hold (min) 5.5.
Final hold (min) 20.5.
I 1004.987.
ReferenceSenatore, Napolitano, et al., 2004Jirovetz L., Buchbauer G., et al., 2001
Comment MSDC-RI MSDC-RI

References

Senatore, Napolitano, et al., 2004
Senatore, F.; Napolitano, F.; Mohamed, M.A.-H.; Harris, P.J.C.; MnKeni, P.N.S.; Henderson, J., Antibacterial activity of Tagetes minuta L. (Asteraceae) essential oil with different chemical composition, Flavour Fragr. J., 2004, 19, 6, 574-578, https://doi.org/10.1002/ffj.1358 . [all data]

Jirovetz L., Buchbauer G., et al., 2001
Jirovetz L.; Buchbauer G.; Shafi P.M.; Rosamma M.K.; Geissler M., Analysis of the composition and aroma of the essential leaf oil of Syzygium travancoricum from South India by GC-FID, GC-MS, and olfactometry. Seasonal changes of composition, Chromatographia Sup., 2001, 53, S1, s372-s374, https://doi.org/10.1007/BF02490359 . [all data]