caryophillan-2,6-β-oxide

Normal alkane RI, polar column, temperature ramp

View large format table.

Column type Active phase I Reference Comment
CapillaryPEG-20M2037.Orav, Kailas, et al., 1996He, 2. K/min; Column length: 50. m; Column diameter: 0.25 mm; Tstart: 70. C; Tend: 250. C

References

Orav, Kailas, et al., 1996
Orav, A.; Kailas, T.; Liiv, M., Analysis of terpenoic composition of conifer needle oils by steam distillation/extraction, gas chromatography and gas chromatography-mass spectrometry, Chromatographia, 1996, 43, 3/4, 215-219, https://doi.org/10.1007/BF02292955 . [all data]