bis(1-methyl-2-oxopropyl) disulfide

Van Den Dool and Kratz RI, non-polar column, temperature ramp

View large format table.

Column type Active phase I Reference Comment
CapillaryBPX-51478.Ames, Guy, et al., 200150. m/0.32 mm/0.5 μm, He, 60. C @ 5. min, 4. K/min, 250. C @ 10. min
CapillaryDB-51476.Mottram, Madruga, et al., 199530. m/0.32 mm/1. μm, He, 60. C @ 5. min, 4. K/min; Tend: 250. C
CapillaryDB-51489.Mottram, Madruga, et al., 199530. m/0.32 mm/1. μm, He, 60. C @ 5. min, 4. K/min; Tend: 250. C

Van Den Dool and Kratz RI, non-polar column, custom temperature program

View large format table.

Column type Active phase I Reference Comment
CapillarySE-541460.Hofmann, Schieberle, et al., 199630. m/0.32 mm/0.25 μm; Program: 40C(2min) => 40C/min => 50C(5min) => 6C/min => 230C(15min)

Van Den Dool and Kratz RI, polar column, custom temperature program

View large format table.

Column type Active phase I Reference Comment
CapillaryFFAP2204.Hofmann, Schieberle, et al., 199630. m/0.32 mm/0.25 μm; Program: 40C(2min) => 40C/min => 60C(5min) => 6C/min => 230C(15min)

References

Ames, Guy, et al., 2001
Ames, J.M.; Guy, R.C.E.; Kipping, G.J., Effect of pH and temperature on the formation of volatile compounds in cysteine/reducing sugar/starch mixtures during extrusion cooking, J. Agric. Food Chem., 2001, 49, 4, 1885-1894, https://doi.org/10.1021/jf0012547 . [all data]

Mottram, Madruga, et al., 1995
Mottram, D.S.; Madruga, M.S.; Whitfield, F.B., Some novel meatlike aroma compounds from the reactions of alkanediones with hydrogen sulfide and fuanthiols, J. Agric. Food Chem., 1995, 43, 1, 189-193, https://doi.org/10.1021/jf00049a035 . [all data]

Hofmann, Schieberle, et al., 1996
Hofmann, T.; Schieberle, P.; Grosch, W., Model studies on the oxidative stability of odor-active thiols occurring in food flavors, J. Agric. Food Chem., 1996, 44, 1, 251-255, https://doi.org/10.1021/jf9500703 . [all data]