(E)-2-pentadecenal

Kovats' RI, non-polar column, temperature ramp

View large format table.

Column type Active phase I Reference Comment
CapillaryDB-11751.Smallfield, Perry, et al., 1994H2, 5. K/min; Column length: 9.5 m; Tstart: 50. C; Tend: 260. C

Normal alkane RI, non-polar column, temperature ramp

View large format table.

Column type Active phase I Reference Comment
CapillaryOV-1011750.Yang and Sugisawa, 1990N2, 2. K/min; Column length: 50. m; Column diameter: 0.25 mm; Tstart: 80. C; Tend: 200. C

References

Smallfield, Perry, et al., 1994
Smallfield, B.M.; Perry, N.B.; Beauregard, D.A.; Foster, L.M.; Dodds, K.G., Effects of postharvest treatments on yield and composition of coriander herb oil, J. Agric. Food Chem., 1994, 42, 2, 354-359, https://doi.org/10.1021/jf00038a023 . [all data]

Yang and Sugisawa, 1990
Yang, R.; Sugisawa, H., Citrus Suachi Hort. ex Shirai. Volatile components in Sudachi (Citrus Sudachi Hort. ex Shirai) juice, Nippon Shokuhin Kogyo Gakkaishi, 1990, 37, 12, 946-952, https://doi.org/10.3136/nskkk1962.37.12_946 . [all data]