(E)-2-Hexadecenal

Kovats' RI, non-polar column, temperature ramp

View large format table.

Column type Active phase I Reference Comment
CapillaryDB-11858.Smallfield, Perry, et al., 1994H2, 5. K/min; Column length: 9.5 m; Tstart: 50. C; Tend: 260. C

Van Den Dool and Kratz RI, non-polar column, temperature ramp

View large format table.

Column type Active phase I Reference Comment
CapillarySPB-11845.Chisholm, Jell, et al., 200330. m/0.25 mm/0.25 μm, He, 35. C @ 5. min, 4. K/min, 225. C @ 20. min
CapillaryDB-51880.Marques, McElfresh, et al., 200030. m/0.25 mm/0.25 μm, 100. C @ 1. min, 5. K/min, 275. C @ 3. min

Van Den Dool and Kratz RI, polar column, temperature ramp

View large format table.

Column type Active phase I Reference Comment
CapillaryDB-Wax2279.Marques, McElfresh, et al., 200030. m/0.32 mm/0.25 μm, 100. C @ 1. min, 5. K/min; Tend: 240. C

Normal alkane RI, non-polar column, custom temperature program

View large format table.

Column type Active phase I Reference Comment
CapillaryBPX-51813.Madruga, Arruda, et al., 200050. m/0.32 mm/0.50 μm, Helium; Program: 40 0C (5 min) 20 0C/min -> 60 0C (5 min) 4 0C/min -> 250 0C (10 min)

References

Smallfield, Perry, et al., 1994
Smallfield, B.M.; Perry, N.B.; Beauregard, D.A.; Foster, L.M.; Dodds, K.G., Effects of postharvest treatments on yield and composition of coriander herb oil, J. Agric. Food Chem., 1994, 42, 2, 354-359, https://doi.org/10.1021/jf00038a023 . [all data]

Chisholm, Jell, et al., 2003
Chisholm, M.G.; Jell, J.A.; Cass, D.M., Jr., Characterization of the major odorants found in the peel oil of Citrus reticulata Blanco cv. Clementine using gas chromatography-olfactometry, Flavour Fragr. J., 2003, 18, 4, 275-281, https://doi.org/10.1002/ffj.1188 . [all data]

Marques, McElfresh, et al., 2000
Marques, F.A.; McElfresh, J.S.; Millar, J.G., Kováts retention indexes of monounsaturated C12, C14, and C16 alcohols, acetates and aldehydes commonly found in lepidopteran pheromone blends, J. Braz. Chem. Soc., 2000, 11, 6, 592-599, https://doi.org/10.1590/S0103-50532000000600007 . [all data]

Madruga, Arruda, et al., 2000
Madruga, M.S.; Arruda, S.G.B.; Narain, N.; Souza, J.G., Castration and slaughter age effects on panel assessment and aroma compounds of the mestico goat meat, Meat Sci., 2000, 56, 2, 117-125, https://doi.org/10.1016/S0309-1740(00)00025-5 . [all data]