(E)-2-tetradecenal

Kovats' RI, polar column, temperature ramp

Data compiled by: NIST Mass Spectrometry Data Center, William E. Wallace, director

Column type Capillary
Active phase DB-Wax
Column length (m) 30.
Carrier gas H2
Substrate
Column diameter (mm)
Phase thickness (μm)
Tstart (C) 50.
Tend (C) 260.
Heat rate (K/min) 5.
Initial hold (min)
Final hold (min)
I 2078.
ReferenceSmallfield, Perry, et al., 1994
Comment MSDC-RI

Normal alkane RI, polar column, temperature ramp

Data compiled by: NIST Mass Spectrometry Data Center, William E. Wallace, director

Column type Capillary
Active phase Supelcowax-10
Column length (m) 60.
Carrier gas He
Substrate
Column diameter (mm) 0.53
Phase thickness (μm) 1.
Tstart (C) 40.
Tend (C) 240.
Heat rate (K/min) 4.
Initial hold (min) 2.
Final hold (min) 20.
I 2098.
ReferenceRochat and Chaintreau, 2005
Comment MSDC-RI

References

Smallfield, Perry, et al., 1994
Smallfield, B.M.; Perry, N.B.; Beauregard, D.A.; Foster, L.M.; Dodds, K.G., Effects of postharvest treatments on yield and composition of coriander herb oil, J. Agric. Food Chem., 1994, 42, 2, 354-359, https://doi.org/10.1021/jf00038a023 . [all data]