2-Methyl-6,7-dihydro-5H-cyclopentapyrazine

Van Den Dool and Kratz RI, non-polar column, temperature ramp

Data compiled by: NIST Mass Spectrometry Data Center, William E. Wallace, director

Column type CapillaryCapillary
Active phase DB-1HP-1
Column length (m) 60.50.
Carrier gas N2
Substrate
Column diameter (mm) 0.250.32
Phase thickness (μm) 1.1.5
Tstart (C) 30.40.
Tend (C) 200.220.
Heat rate (K/min) 5.2.
Initial hold (min)
Final hold (min) 30.30.
I 1179.1162.
ReferenceWu, Wang, et al., 2000Zhang, Dorjpalam, et al., 1992
Comment MSDC-RI MSDC-RI

References

Wu, Wang, et al., 2000
Wu, C.-M.; Wang, Z.; Wu, Q.H., Volatile compounds produced from monosodium glutamate in common food cooking, J. Agric. Food Chem., 2000, 48, 6, 2438-2442, https://doi.org/10.1021/jf9907743 . [all data]

Zhang, Dorjpalam, et al., 1992
Zhang, Y.; Dorjpalam, B.; Ho, C.-T., Contribution of peptides to volatile formation in the Maillard reaction of casein hydrolysate with glucose, J. Agric. Food Chem., 1992, 40, 12, 2467-2471, https://doi.org/10.1021/jf00024a026 . [all data]