tris-(2,3-Dihydroxypropyl)amine, hexakis-TMS

Normal alkane RI, non-polar column, temperature ramp

View large format table.

Column type Active phase I Reference Comment
CapillarySPB-12274.Velísek, Ledahudcová, et al., 199215. m/0.53 mm/1.5 μm, N2, 5. K/min; Tstart: 80. C; Tend: 250. C

References

Velísek, Ledahudcová, et al., 1992
Velísek, J.; Ledahudcová, K.; Hajslová, J.; Pech, P.; Kubelka, V.; Víden, I., New 3-chloro-1,2-propanediol derived dihydroxypropylamines in hydrolyzed vegetable proteins, J. Agric. Food Chem., 1992, 40, 8, 1389-1392, https://doi.org/10.1021/jf00020a020 . [all data]