1-isopentyl-2(1H)-pyrazinone

Van Den Dool and Kratz RI, non-polar column, temperature ramp

View large format table.

Column type Active phase I Reference Comment
CapillaryHP-11432.Oh, Shu, et al., 199250. m/0.32 mm/1.05 μm, He, 2. K/min, 260. C @ 40. min; Tstart: 40. C

References

Oh, Shu, et al., 1992
Oh, Y.-C.; Shu, C.-K.; Ho, C.-T., Formation of novel 2(1H)-pyrazinones as peptide-specific Maillard reaction products, J. Agric. Food Chem., 1992, 40, 1, 118-121, https://doi.org/10.1021/jf00013a022 . [all data]