3-hydroxy-7,8-didehydro-β-ionol

Normal alkane RI, non-polar column, temperature ramp

View large format table.

Column type Active phase I Reference Comment
CapillaryHP-11527.Osorio, Duque, et al., 200325. m/0.2 mm/0.33 μm, He, 4. K/min; Tstart: 50. C; Tend: 300. C

Normal alkane RI, polar column, custom temperature program

View large format table.

Column type Active phase I Reference Comment
CapillaryDB-Wax2763.Osorio, Duque, et al., 2003Program: not specified
CapillaryDB-Wax2758.Marlatt, Ho, et al., 199230. m/0.25 mm/0.25 μm; Program: not specified

References

Osorio, Duque, et al., 2003
Osorio, C.; Duque, C.; Batista-Viera, F., Studies on aroma generation in lulo (Solanum quitoense): enzymatic hydrolysis of glycosides from leaves, Food Chem., 2003, 81, 3, 333-340, https://doi.org/10.1016/S0308-8146(02)00427-2 . [all data]

Marlatt, Ho, et al., 1992
Marlatt, C.; Ho, C.-T.; Chien, M., Studies of aroma constituents bound as glycosides in tomato, J. Agric. Food Chem., 1992, 40, 2, 249-252, https://doi.org/10.1021/jf00014a016 . [all data]