Disulfide, methyl 1-propenyl, trans

Van Den Dool and Kratz RI, polar column, temperature ramp

Data compiled by: NIST Mass Spectrometry Data Center, William E. Wallace, director

Column type CapillaryCapillaryCapillaryCapillaryCapillary
Active phase DB-WaxDB-WaxCP-Wax 52CBCP-Wax 52CBCP-Wax 52CB
Column length (m) 30.60.50.50.50.
Carrier gas He N2N2N2
Substrate
Column diameter (mm) 0.250.250.250.250.22
Phase thickness (μm) 0.250.25
Tstart (C) 40.40.60.60.50.
Tend (C) 240.200.200.200.200.
Heat rate (K/min) 6.3.2.2.2.
Initial hold (min) 10.5.4.4.
Final hold (min) 30.60.30.30.
I 1292.1287.1290.1289.1270.
ReferenceNielsen, Larsen, et al., 2003Cha, Kim, et al., 1998Kim, Wu, et al., 1995Kim, Wu, et al., 1995Yu, Wu, et al., 1989
Comment MSDC-RI MSDC-RI MSDC-RI MSDC-RI MSDC-RI
Column type Capillary
Active phase CP-Wax 52CB
Column length (m) 50.
Carrier gas N2
Substrate
Column diameter (mm) 0.22
Phase thickness (μm)
Tstart (C) 50.
Tend (C) 200.
Heat rate (K/min) 2.
Initial hold (min)
Final hold (min)
I 1270.
ReferenceYu, Wu, et al., 1989, 2
Comment MSDC-RI

Van Den Dool and Kratz RI, non-polar column, custom temperature program

Data compiled by: NIST Mass Spectrometry Data Center, William E. Wallace, director

Column type Capillary
Active phase SPB-1
Column length (m) 30.
Carrier gas N2
Substrate
Column diameter (mm) 0.32
Phase thickness (μm) 4.0
Program 40 0C (10 min), 2 0C/min to 180 0C, 25 0C/min to 250 0C (5 min)
I 919.
ReferenceMochizuki, Yamamoto, et al., 1998
Comment MSDC-RI

References

Nielsen, Larsen, et al., 2003
Nielsen, G.S.; Larsen, L.M.; Poll, L., Formation of aroma compounds and lipoxygenase (EC 1.13.11.12) activity in unblanced leek (Allium ampeloprasum Var. Bulga) slices during long-term frozen storage, J. Agric. Food Chem., 2003, 51, 7, 1970-1976, https://doi.org/10.1021/jf020921o . [all data]

Cha, Kim, et al., 1998
Cha, Y.J.; Kim, H.; Cadwallader, K.R., Aroma-active compounds in Kimchi during fermentation, J. Agric. Food Chem., 1998, 46, 5, 1944-1953, https://doi.org/10.1021/jf9706991 . [all data]

Kim, Wu, et al., 1995
Kim, S.M.; Wu, C.M.; Kubota, K.; Kobayashi, A., Effect of soybean oil on garlic volatile compounds isoalted by distillation, J. Agric. Food Chem., 1995, 43, 2, 449-452, https://doi.org/10.1021/jf00050a036 . [all data]

Yu, Wu, et al., 1989
Yu, T.-H.; Wu, C.-M.; Liou, Y.-C., Volatile compounds from garlic, J. Agric. Food Chem., 1989, 37, 3, 725-730, https://doi.org/10.1021/jf00087a032 . [all data]

Yu, Wu, et al., 1989, 2
Yu, T.-H.; Wu, C.-M.; Chen, S.-Y., Effects of pH adjustment and heat treatment on the stability and the formation of volatile compounds of garlic, J. Agric. Food Chem., 1989, 37, 3, 730-734, https://doi.org/10.1021/jf00087a033 . [all data]