di-2-furfuryl trisulfide

Van Den Dool and Kratz RI, non-polar column, temperature ramp

View large format table.

Column type Active phase I Reference Comment
CapillaryDB-51879.Mottram, Madruga, et al., 199530. m/0.32 mm/1. μm, He, 60. C @ 5. min, 4. K/min; Tend: 250. C
CapillaryDB-11901.Zhang and Ho, 199160. m/0.25 mm/0.25 μm, He, 2. K/min, 220. C @ 10. min; Tstart: 40. C
CapillaryDB-11901.Zhang and Ho, 199160. m/0.25 mm/0.25 μm, He, 2. K/min, 220. C @ 10. min; Tstart: 40. C

References

Mottram, Madruga, et al., 1995
Mottram, D.S.; Madruga, M.S.; Whitfield, F.B., Some novel meatlike aroma compounds from the reactions of alkanediones with hydrogen sulfide and fuanthiols, J. Agric. Food Chem., 1995, 43, 1, 189-193, https://doi.org/10.1021/jf00049a035 . [all data]

Zhang and Ho, 1991
Zhang, Y.; Ho, C.-T., Formation of meatlike aroma compounds from thermal reaction of inosine 5'-monophosphate with cysteine and glutathione, J. Agric. Food Chem., 1991, 39, 6, 1145-1148, https://doi.org/10.1021/jf00006a031 . [all data]