2,3-Dimethyl-6,7-dihydro-5H-cyclopentapyrazine

Van Den Dool and Kratz RI, non-polar column, temperature ramp

Data compiled by: NIST Mass Spectrometry Data Center, William E. Wallace, director

Column type Capillary
Active phase DB-1
Column length (m) 50.
Carrier gas He
Substrate
Column diameter (mm) 0.32
Phase thickness (μm) 1.05
Tstart (C) 40.
Tend (C) 260.
Heat rate (K/min) 2.
Initial hold (min)
Final hold (min) 40.
I 1202.
ReferenceIzzo and Ho, 1991
Comment MSDC-RI

References

Izzo and Ho, 1991
Izzo, H.V.; Ho, C.-T., Isolation and identification of the volatile components of an extruded autolyzed yeast extract, J. Agric. Food Chem., 1991, 39, 12, 2245-2248, https://doi.org/10.1021/jf00012a029 . [all data]