(Z)-2-hexenal

Van Den Dool and Kratz RI, polar column, custom temperature program

Data compiled by: NIST Mass Spectrometry Data Center, William E. Wallace, director

Column type CapillaryCapillary
Active phase Supelcowax-10Supelcowax-10
Column length (m) 30.30.
Carrier gas HeHe
Substrate
Column diameter (mm) 0.250.25
Phase thickness (μm) 0.250.25
Program 35C(8min) => 4C/min => 60C => 6C/min => 160C => 20C/min => 200C(1min)40C(2min) => 40C/min => 60(2min)C => 5C/min => 240C
I 1189.1204.
ReferenceBianchi, Careri, et al., 2007Majcher and Jelén, 2005
Comment MSDC-RI MSDC-RI

Van Den Dool and Kratz RI, non-polar column, temperature ramp

Data compiled by: NIST Mass Spectrometry Data Center, William E. Wallace, director

Column type CapillaryCapillaryCapillary
Active phase HP-5HP-5MSCP Sil 5 CB
Column length (m) 30.30.30.
Carrier gas HeHeH2
Substrate
Column diameter (mm) 0.250.250.25
Phase thickness (μm) 0.250.250.25
Tstart (C) 50.60.60.
Tend (C) 250.250.280.
Heat rate (K/min) 4.4.2.
Initial hold (min) 4.2.10.
Final hold (min) 10.20.40.
I 841.841.804.
ReferenceQuijano, Salamanca, et al., 2007Pino, Mesa, et al., 2005Pino, Marbot, et al., 2002
Comment MSDC-RI MSDC-RI MSDC-RI

References

Bianchi, Careri, et al., 2007
Bianchi, F.; Careri, M.; Mangia, A.; Musci, M., Retention indices in the analysis of food aroma volatile compounds in temperature-programmed gas chromatography: Database creation and evaluation of precision and robustness, J. Sep. Sci., 2007, 39, 4, 563-572, https://doi.org/10.1002/jssc.200600393 . [all data]

Majcher and Jelén, 2005
Majcher, M.A.; Jelén, H.H., Identification of potent odorants formed during the preparation of extruded potato snacks, J. Agric. Food Chem., 2005, 53, 16, 6432-6437, https://doi.org/10.1021/jf050412x . [all data]