non-1-en-4-one

Van Den Dool and Kratz RI, non-polar column, temperature ramp

View large format table.

Column type Active phase I Reference Comment
CapillaryOV-11044.Wu and Liou, 1986H2, 2. K/min, 200. C @ 55. min; Column length: 50. m; Column diameter: 0.2 mm; Tstart: 50. C

Van Den Dool and Kratz RI, polar column, temperature ramp

View large format table.

Column type Active phase I Reference Comment
CapillaryCarbowax 20M1347.Wu and Liou, 1986H2, 2. K/min, 200. C @ 55. min; Column length: 50. m; Column diameter: 0.2 mm; Tstart: 50. C

References

Wu and Liou, 1986
Wu, C.-M.; Liou, S.-E., Effect of tissue disruption of volatile constituents of bell peppers, J. Agric. Food Chem., 1986, 34, 4, 770-772, https://doi.org/10.1021/jf00070a044 . [all data]