Edulan

Van Den Dool and Kratz RI, non-polar column, temperature ramp

View large format table.

Column type Active phase I Reference Comment
CapillaryBP-1936.Strauss, Dimitriadis, et al., 1986140. C @ 10. min, 2. K/min; Column length: 25. m; Phase thickness: 0.5 μm; Tend: 280. C

Normal alkane RI, non-polar column, temperature ramp

View large format table.

Column type Active phase I Reference Comment
CapillaryZB-5946.Jürgens and Dötterl, 200460. m/0.25 mm/0.25 μm, He, 40. C @ 4.6 min, 6. K/min, 260. C @ 1. min
CapillaryZB-5952.Jürgens and Dötterl, 200460. m/0.25 mm/0.25 μm, He, 40. C @ 4.6 min, 6. K/min, 260. C @ 1. min

References

Strauss, Dimitriadis, et al., 1986
Strauss, C.R.; Dimitriadis, E.; Wilson, B.; Williams, P.J., Studies on the hydrolysis of two megastigma-3,6,9-triols rationalizing the origins of some volatile C13 norisoprenoids of vitis vinifera grapes, J. Agric. Food Chem., 1986, 34, 1, 145-149, https://doi.org/10.1021/jf00067a039 . [all data]

Jürgens and Dötterl, 2004
Jürgens, A.; Dötterl, S., Chemical composition of anther volatiles in Ranunculaceae: genera-specific profiles in Aemone, Aquilegia, Caltha, Pulsatilla, Ranunculus, and Trollius species, American Journal of Botany, 2004, 91, 12, 1969-1980, https://doi.org/10.3732/ajb.91.12.1969 . [all data]