phytadiene

Normal alkane RI, non-polar column, temperature ramp

Data compiled by: NIST Mass Spectrometry Data Center, William E. Wallace, director

Column type CapillaryCapillaryCapillary
Active phase DB-5HP-5MSSE-54
Column length (m) 30.30.30.
Carrier gas HeHeHe
Substrate
Column diameter (mm) 0.250.250.25
Phase thickness (μm) 0.250.250.25
Tstart (C) 40.60.60.
Tend (C) 250.280.260.
Heat rate (K/min) 4.3.2.
Initial hold (min) 2. 5.
Final hold (min) 10.
I 1861.1861.1856.
ReferenceShen X., Gao Y., et al., 2006Tzakou, Said, et al., 2006Kilic, Hafizoglu, et al., 2004
Comment MSDC-RI MSDC-RI MSDC-RI

References

Shen X., Gao Y., et al., 2006
Shen X.; Gao Y.; Su Q.D., Constituents of the essential oil of Rhizoma polygonati, Flavour Fragr. J., 2006, 21, 3, 556-558, https://doi.org/10.1002/ffj.1666 . [all data]

Tzakou, Said, et al., 2006
Tzakou, O.; Said, A.; Farag, A.; Rashed, K., Volatile constituents of Ailanthus excelsa Roxb., Flavour Fragr. J., 2006, 21, 6, 899-901, https://doi.org/10.1002/ffj.1739 . [all data]

Kilic, Hafizoglu, et al., 2004
Kilic, A.; Hafizoglu, H.; Kollmannsberger, H.; Nitz, S., Volatile constituents and key odorants in leaves, buds, flowers, and fruits of Laurus nobilis L., J. Agric. Food Chem., 2004, 52, 6, 1601-1606, https://doi.org/10.1021/jf0306237 . [all data]