3,3-dimethylcyclohex-6-en-1-yl propionate

Normal alkane RI, non-polar column, custom temperature program

View large format table.

Column type Active phase I Reference Comment
CapillaryDB-11360.Hedin, Burks, et al., 1985Column length: 60. m; Column diameter: 0.322 mm; Program: not specified

References

Hedin, Burks, et al., 1985
Hedin, P.A.; Burks, M.L.; Thompson, A.C., Synthetic intermediates and byproducts as inhibitors of boll weevil pheromone attractancy, J. Agric. Food Chem., 1985, 33, 6, 1011-1017, https://doi.org/10.1021/jf00066a001 . [all data]