24-Ethyl-5-β-cholestan-3-one, oxime, TMS # 2

Normal alkane RI, non-polar column, temperature ramp

Data compiled by: NIST Mass Spectrometry Data Center, William E. Wallace, director

Column type Capillary
Active phase SE-30
Column length (m) 25.
Carrier gas He
Substrate
Column diameter (mm) 0.32
Phase thickness (μm) 0.25
Tstart (C) 200.
Tend (C) 270.
Heat rate (K/min) 10.
Initial hold (min)
Final hold (min)
I 3382.
ReferenceTandon, Axelson, et al., 1984
Comment MSDC-RI

References

Tandon, Axelson, et al., 1984
Tandon, R.; Axelson, M.; Sjövall, J., Selective liquid chromatographic isolation and gas chromatographic-mass spectrometric analysis of ketonic bile acids in faeces, J. Chromatogr., 1984, 302, 1-14, https://doi.org/10.1016/S0021-9673(01)88993-7 . [all data]