Heptacosane, 2,6,10,14,18,22-hexamethyl

Normal alkane RI, non-polar column, temperature ramp

Data compiled by: NIST Mass Spectrometry Data Center, William E. Wallace, director

Column type CapillaryCapillary
Active phase Apiezon LApieson L
Column length (m)  50.
Carrier gas  He
Substrate  Gas-Chrom Q
Column diameter (mm)  0.25
Phase thickness (μm)
Tstart (C) 130.120.
Tend (C) 300.280.
Heat rate (K/min) 2.6.
Initial hold (min)
Final hold (min)
I 2870.2885.
ReferenceShlyakhov, 1984Albaigès, Borbón, et al., 1981
Comment MSDC-RI MSDC-RI

References

Shlyakhov, 1984
Shlyakhov, A.F., Gas chromatography in organic geochemistry, Nedra, Moscow, 1984, 221. [all data]

Albaigès, Borbón, et al., 1981
Albaigès, J.; Borbón, J.; Gassiot, M., Gas chromatographic-mass spectrometric identification of geochemically significant isoalkane hydrocarbons, J. Chromatogr., 1981, 204, 491-498, https://doi.org/10.1016/S0021-9673(00)81696-9 . [all data]