5-α-Cholest-22-en-3-β-ol, cis

Kovats' RI, non-polar column, isothermal

Data compiled by: NIST Mass Spectrometry Data Center, William E. Wallace, director

Column type Capillary
Active phase Methyl Silicone
Column length (m)
Carrier gas
Substrate
Column diameter (mm)
Phase thickness (μm)
Temperature (C) 250.
I 3080.
ReferenceShlyakhov, 1984
Comment MSDC-RI

References

Shlyakhov, 1984
Shlyakhov, A.F., Gas chromatography in organic geochemistry, Nedra, Moscow, 1984, 221. [all data]