Benzo[b]phenanthro[3,4-d]thiophene

Lee's RI, non-polar column, temperature ramp

View large format table.

Column type Active phase I Reference Comment
CapillaryDB-5486.2Becker and Colmsjö, 199830. m/0.25 mm/0.25 μm, He, 110. C @ 1. min, 10. K/min, 325. C @ 5. min
CapillaryDB-5467.2Becker and Colmsjö, 199830. m/0.25 mm/0.25 μm, He, 110. C @ 1. min, 10. K/min, 325. C @ 5. min
CapillarySE-52487.76Vassilaros, Kong, et al., 198220. m/0.30 mm/0.25 μm, H2, 40. C @ 2. min, 4. K/min; Tend: 265. C
CapillarySE-52470.47Vassilaros, Kong, et al., 198220. m/0.30 mm/0.25 μm, H2, 40. C @ 2. min, 4. K/min; Tend: 265. C

Lee's RI, non-polar column, custom temperature program

View large format table.

Column type Active phase I Reference Comment
CapillaryHP-5480.6Becker, Colmsjo, et al., 199950. m/0.32 mm/0.50 μm, Helium; Program: not specified
CapillaryDB-5481.7Becker and Colmsjö, 199830. m/0.25 mm/0.25 μm, He; Program: 110C(1min) => 40C/min => 160C => 10C/min => 300C925min)
CapillaryDB-5480.8Becker and Colmsjö, 199830. m/0.25 mm/0.25 μm, He; Program: 35C(2min) => 25C/min => 160C => 3C/min => 300C(25min)
CapillaryDB-5458.5Becker and Colmsjö, 199830. m/0.25 mm/0.25 μm, He; Program: 110C(1min) => 40C/min => 160C => 10C/min => 300C925min)
CapillaryDB-5458.0Becker and Colmsjö, 199830. m/0.25 mm/0.25 μm, He; Program: 35C(2min) => 25C/min => 160C => 3C/min => 300C(25min)
CapillaryHP-5480.6Becker, Nilsson, et al., 199850. m/0.32 mm/0.5 μm, He; Program: 35C => 25C/min => 160C => 3C/min => 300C(50min)

References

Becker and Colmsjö, 1998
Becker, G.; Colmsjö, A., Gas chromatography-atomic emission detection for quantification of polycyclic aromatic sulfur heterocycles, Anal. Chim. Acta., 1998, 376, 3, 265-272, https://doi.org/10.1016/S0003-2670(98)00546-7 . [all data]

Vassilaros, Kong, et al., 1982
Vassilaros, D.L.; Kong, R.C.; Later, D.W.; Lee, M.L., Linear retention index system for polycyclic aromatic compounds. Critical evaluation and additional indices, J. Chromatogr., 1982, 252, 1-20, https://doi.org/10.1016/S0021-9673(01)88394-1 . [all data]

Becker, Colmsjo, et al., 1999
Becker, G.; Colmsjo, A.; Ostman, C., Determination of Thiaarenes and Polycyclic Aromatic Hydrocarbons in Workplace Air of an Aluminium Reduction Plant, Environ. Sci. Technol., 1999, 33, 9, 1321-1327, https://doi.org/10.1021/es981151t . [all data]

Becker, Nilsson, et al., 1998
Becker, G.; Nilsson, U.; Colmsjö, A.; Östman, C., Determination of polycyclic aromatic sulfur heterocyclic compounds in airborne particulate by gas chromatography with atomic emission and mass spectrometric detection, J. Chromatogr. A, 1998, 826, 1, 57-66, https://doi.org/10.1016/S0021-9673(98)00729-8 . [all data]