10-methylundecanol

Kovats' RI, non-polar column, temperature ramp

View large format table.

Column type Active phase I Reference Comment
CapillaryOV-1011443.Ohnishi and Shibamoto, 19842. K/min; Column length: 50. m; Column diameter: 0.23 mm; Tstart: 80. C; Tend: 200. C
CapillaryOV-1011447.Ohnishi and Shibamoto, 19842. K/min; Column length: 50. m; Column diameter: 0.23 mm; Tstart: 80. C; Tend: 200. C

References

Ohnishi and Shibamoto, 1984
Ohnishi, S.; Shibamoto, T., Volatile compounds from heated beef fat and beef fat with glycine, J. Agric. Food Chem., 1984, 32, 5, 987-992, https://doi.org/10.1021/jf00125a008 . [all data]