Kessane

Normal alkane RI, polar column, custom temperature program

Data compiled by: NIST Mass Spectrometry Data Center, William E. Wallace, director

Column type CapillaryCapillaryCapillaryCapillaryCapillary
Active phase HP-Innowax FSCHP-Innowax FSCHP-Innowax FSCCarbowax 20MInnowax FSC
Column length (m) 60.60.60. 60.
Carrier gas He He He
Substrate
Column diameter (mm) 0.250.250.25 0.25
Phase thickness (μm) 0.250.250.25 0.25
Program 60C(10min) => 4C/min => 220C (10min) => 1C/min => 240C60C(10min) => 4C/min => 220C (10min) => 1C/min => 240C60C(10min) => 4C/min => 220C(10min) => 1C/min => 240Cnot specified60C(10min) => 4C/min => 220C(10min) => 1C/min => 240C
I 1786.1785.1786.1779.1786.
ReferenceErdurak, Coskun, et al., 2006Tabanca, Demirci, et al., 2006Tabanca, Demirci, et al., 2005Vinogradov, 2004Baser, Demirei, et al., 2002
Comment MSDC-RI MSDC-RI MSDC-RI MSDC-RI MSDC-RI

References

Erdurak, Coskun, et al., 2006
Erdurak, C.S.; Coskun, M.; Demirci, B.; Baser, K.H.C., Composition of the essential oil of fruits and roots of Ferulago isaurica Pesmen and F. syriaca Boiss. (Umbelliferae) from Turkey, Flavour Fragr. J., 2006, 21, 1, 118-121, https://doi.org/10.1002/ffj.1540 . [all data]

Tabanca, Demirci, et al., 2006
Tabanca, N.; Demirci, B.; Ozek, T.; Kirimer, N.; Can Baser, K.H.; Bedir, E.; Khan, I.A.; Wedge, D.E., Gas chromatographic-mass spectrometric analysis of essential oils from Pimpinella species gathered from Central and Northern Turkey, J. Chromatogr. A, 2006, 1117, 2, 194-205, https://doi.org/10.1016/j.chroma.2006.03.075 . [all data]

Tabanca, Demirci, et al., 2005
Tabanca, N.; Demirci, B.; Kirimer, N.; Baser, K.H.C.; Bedir, E.; Khand, I.A.; Wedge, D.E., Gas chromatographic-mass spectrometric analysis of essential oils from Pimpinella aurea, Pimpinella corymbosa, Pimpinella peregrina and Pimpinella puberula gathered from Eastern and Southern Turkey, J. Chromatogr. A, 2005, 1097, 1-2, 192-198, https://doi.org/10.1016/j.chroma.2005.10.047 . [all data]

Vinogradov, 2004
Vinogradov, B.A., Production, composition, properties and application of essential oils, 2004, retrieved from http://viness.narod.ru. [all data]

Baser, Demirei, et al., 2002
Baser, K.H.C.; Demirei, B.; Özek, T.; Akalin, E.; Özhatay, N., Micro-distilled volatile compounds from Ferulago species growing in Western Turkey, Pharm. Biol., 2002, 40, 6, 466-471, https://doi.org/10.1076/phbi.40.6.466.8439 . [all data]