3-methyldec-3-en-1-ol

Normal alkane RI, non-polar column, temperature ramp

Data compiled by: NIST Mass Spectrometry Data Center, William E. Wallace, director

Column type Capillary
Active phase DB-1
Column length (m) 60.
Carrier gas
Substrate
Column diameter (mm) 0.32
Phase thickness (μm)
Tstart (C) 50.
Tend (C) 250.
Heat rate (K/min) 4.
Initial hold (min) 0.1
Final hold (min) 5.
I 1308.
ReferenceFlath, Mon, et al., 1983
Comment MSDC-RI

References

Flath, Mon, et al., 1983
Flath, R.A.; Mon, T.R.; Lorenz, G.; Whitten, C.J.; Mackley, J.W., Volatile components of Acacia sp. blossoms, J. Agric. Food Chem., 1983, 31, 6, 1167-1170, https://doi.org/10.1021/jf00120a008 . [all data]