Zn-TETMP complex

Normal alkane RI, non-polar column, temperature ramp

View large format table.

Column type Active phase I Reference Comment
CapillaryOV-15220.Marriott, Gill, et al., 1982H2, 7. K/min; Column length: 6. m; Column diameter: 0.30 mm; Tstart: 60. C; Tend: 300. C

References

Marriott, Gill, et al., 1982
Marriott, P.J.; Gill, J.P.; Eglinton, G., Capillary Gas Chromatography of Metal-Porphyrin Complexes, J. Chromatogr., 1982, 236, 2, 395-401, https://doi.org/10.1016/S0021-9673(00)84890-6 . [all data]