ethyl propyl succinate

Normal alkane RI, polar column, custom temperature program

Data compiled by: NIST Mass Spectrometry Data Center, William E. Wallace, director

Column type CapillaryCapillary
Active phase Carbowax 20MCarbowax 20M
Column length (m) 60.60.
Carrier gas HeHe
Substrate
Column diameter (mm) 0.250.25
Phase thickness (μm)
Program not specifiednot specified
I 1757.1759.
ReferenceFagan, Kepner, et al., 1982Fagan, Kepner, et al., 1982
Comment MSDC-RI MSDC-RI

References

Fagan, Kepner, et al., 1982
Fagan, G.L.; Kepner, R.E.; Webb, A.D., Additional volatile components of Palomino film sherry, Am. J. Enol. Vitic, 1982, 33, 1, 47-50. [all data]