karahana ether

Kovats' RI, polar column, temperature ramp

Data compiled by: NIST Mass Spectrometry Data Center, William E. Wallace, director

Column type CapillaryCapillary
Active phase Carbowax 20MCarbowax 20M
Column length (m) 50.50.
Carrier gas HeHe
Substrate
Column diameter (mm) 0.280.28
Phase thickness (μm)
Tstart (C) 70.70.
Tend (C) 190.190.
Heat rate (K/min) 2.2.
Initial hold (min)
Final hold (min)
I 1368.1370.
ReferenceTressl, Friese, et al., 1978Tressl, Friese, et al., 1978, 2
Comment MSDC-RI MSDC-RI

References

Tressl, Friese, et al., 1978
Tressl, R.; Friese, L.; Fendesack, F.; Köppler, H., Gas chromatographic--mass spectrometric investigation of hop aroma constituents in beer, J. Agric. Food Chem., 1978, 26, 6, 1422-1426, https://doi.org/10.1021/jf60220a037 . [all data]

Tressl, Friese, et al., 1978, 2
Tressl, R.; Friese, L.; Fendesack, F.; Köppler, H., Studies of the volatile composition of hops during storage, J. Agric. Food Chem., 1978, 26, 6, 1426-1430, https://doi.org/10.1021/jf60220a036 . [all data]