γ-Cuprenene

Kovats' RI, polar column, isothermal

Data compiled by: NIST Mass Spectrometry Data Center, William E. Wallace, director

Column type Packed
Active phase Carbowax 20M
Column length (m) 7.3
Carrier gas
Substrate
Column diameter (mm)
Phase thickness (μm)
Temperature (C) 150.
I 1707.
ReferenceAndersen, Bissonette, et al., 1977
Comment MSDC-RI

Normal alkane RI, non-polar column, temperature ramp

Data compiled by: NIST Mass Spectrometry Data Center, William E. Wallace, director

Column type Capillary
Active phase CP Sil 5 CB
Column length (m) 25.
Carrier gas He
Substrate
Column diameter (mm)
Phase thickness (μm)
Tstart (C) 80.
Tend (C) 270.
Heat rate (K/min) 10.
Initial hold (min)
Final hold (min)
I 1523.
ReferenceAyoub, Al-Azizi, et al., 2006
Comment MSDC-RI

References

Andersen, Bissonette, et al., 1977
Andersen, N.H.; Bissonette, P.; Liu, C.-B.; Shunk, B.; Ohta, Y.; Tseng, C.-L.W.; Moore, A.; Huneck, S., Sesquiterpenes of nine European liverworts from the genera, Anastrepta, Bazzania, Jungermannia, Lepidozia, and Scapania, Phytochemistry, 1977, 16, 11, 1731-1751, https://doi.org/10.1016/0031-9422(71)85081-1 . [all data]