5-heptenal

Kovats' RI, non-polar column, custom temperature program

View large format table.

Column type Active phase I Reference Comment
PackedApiezon L874.Minyard, Tumlinson, et al., 1967N2, Gas Chrom P; Column length: 3.0 m; Program: not specified

Kovats' RI, polar column, isothermal

View large format table.

Column type Active phase Temperature (C) I Reference Comment
PackedCarbowax 4000140.1276.Minyard, Tumlinson, et al., 1967N2, GAS Chrom P; Column length: 10. m

References

Minyard, Tumlinson, et al., 1967
Minyard, J.P.; Tumlinson, J.H.; Thompson, A.C.; Hedin, P.A., Constituents of the cotton bud. The carbonyl compounds, J. Agric. Food Chem., 1967, 15, 3, 517-524, https://doi.org/10.1021/jf60151a021 . [all data]